{"text_format":"1","workbook":"xlsx","n_sheets":8,"sheets":["Steuerung","Erlaeuterungen","Eingabedaten","Parameter","MA-Stammdaten","Muster Abrechnung","Muster Stammdaten","Pauschalsätze KUA"],"not_rendered":{"charts":0,"images":18,"macros":1,"external_links":0,"defined_names":43,"comments":0,"pivot_tables":0},"unopened":[],"bounds":{"document_bytes":16777216,"sheet_cells":100000,"rows_first":2000,"rows_last":500,"rows_between":2000,"halvings":0,"cell_chars":16384,"cell_head_chars":4096},"cells_cut":0,"cells_raw":0,"read":"whole","date_system":"1900"}

{"sheet":"Steuerung","index":0,"n_rows":30,"n_cols":2,"rows_kept":30,"cut":false,"hidden":false,"merged":[[2,1,2,5],[3,1,3,5]]}
[]
[]
[null,"COVID-19 Kurzarbeitsbeihilfe AMSG"]
[null,"Projekte mit Beginn ab 01.03.2020"]
[]
[]
[]
[]
[]
[]
[]
[]
[]
[]
[]
[]
[]
[]
[]
[]
[]
[]
[]
[]
[]
[]
[]
[]
[]
["Version 4.207 COVID-19"]

{"sheet":"Erlaeuterungen","index":1,"n_rows":46,"n_cols":1,"rows_kept":46,"cut":false,"hidden":false,"merged":[]}
[]
["Allgemeine Hinweise"]
["Erfassen Sie zuerst über das Arbeitsblatt \"Steuerung\" mit \"Projektdaten erfassen\" die grundlegenen Projektdaten und in der Folge unter dem Blatt \"MA-Stammdaten erfassen/ändern\" die Stammdaten alle Arbeitnehmerinnen/Arbeitnehmer und Lehrlinge, für die Sie eine Abrechnung Ihrer COVID-19-Kurzarbeitsbeihilfe erstellen wollen. Es sind alle Arbeitnehmerinnen/Arbeitnehmer und Lehrlinge, für die Sie eine Kurzarbeitsbeihilfe beantragt haben, bereits bei der ersten Abrechnung anzuführen. Sie sind auch dann anzulegen, wenn im ersten Monat kein Arbeitsausfall vorliegt. \n\nErst wenn Sie alle Arbeitnehmerinnen/Arbeitnehmer und Lehrlinge erfasst haben, ist über die Schaltfläche \"Abrechnung erstellen/bearbeiten\" die monatliche Teilabrechnung zu erstellen. Beachten Sie bitte, dass nachträglich keine weiteren Personen in dieses Abrechnungsblatt aufgenommen bzw. Stammdaten verändert werden können. Sollten Sie wirklich jemanden vergessen haben, müssen Sie die Monatabrechnung löschen und erneut beginnen.\n\nBitte verändern Sie weder den vorgegebenen Dateinamen noch nachträglich die Inhalte der generierten csv-Datei. Nur so ist die automatische Weiterverarbeitung im AMS sichergestellt.\n\nAchtung: Haben Sie uns schon eine monatliche Abrechnung per eAMS-Konto übermittelt, können nachträglich keine weiteren Personen für den bereits übermittelten Abrechnungsmonat anerkannt werden."]
["Erläuterungen zu den Projektdaten"]
["Projektnummer"]
["Die Projektnummer finden Sie in der Förderungsmitteilung, die Sie zu Ihrer Kurzarbeitsbeihilfe erhalten haben. Bitte geben Sie nur die Zahl ein (ohne P).\n\nAchtung! Sollten Sie einen Kurzarbeits-Verlängerungsantrag gestellt haben, wurde Ihnen eine entsprechende Förderungsmitteilung zugestellt. Bitte entnehmen Sie dieser Förderungsmitteilung die dazugehörige Projektnummer. \n\nDie personenbezogenen Daten und die Daten vor Einführung der COVID-19 Kurzarbeit können Sie auch für die Abrechnung der Teilabrechnung des Verlängerungsantrages verwenden.\n"]
["Beginn der Kurzarbeitsbeihilfe"]
["Den Beginn der Kurzarbeitsbeihilfe finden Sie in der Förderungsmitteilung, die Sie zu Ihrer Kurzarbeitsbeihilfe erhalten haben.\n\nAchtung! Sollten Sie einen Kurzarbeits-Verlängerungsantrag gestellt haben, wurde Ihnen danach eine entsprechende Förderungsmitteilung zugestellt. Bitte entnehmen Sie dieser Förderungsmitteilung den dazugehörigen Beginn der Kurzarbeitsbeihilfe.\n"]
["Ende der Kurzarbeitsbeihilfe"]
["Das Ende der Kurzarbeitsbeihilfe finden Sie in der Förderungsmitteilung, die Sie zu Ihrer Kurzarbeitsbeihilfe erhalten haben.\n\nAchtung! Sollten Sie einen Kurzarbeits-Verlängerungsantrag gestellt haben, wurde Ihnen eine Förderungsmitteilung über den Verlängerungszeitraum zugestellt. Bitte entnehmen Sie dieser Förderungsmitteilung das dazugehörige Ende der Kurzarbeitsbeihilfe. \n"]
["Abrechnungszeitraum (Abrechnung von, Abrechnung bis)"]
["Die Kurzarbeit ist monatlich abzurechnen. Wenn die Kurzarbeit im 1. Monat nicht am 1. des Monats begonnen hat, endet der 1. Abrechnungszeitraum trotzdem am Letzten des 1. Monats.\nBeispiel: \nIhre Kurzarbeitsbeihilfe wurde vom 16.3.2020 bis 15.6.2020 genehmigt.\nIn diesem Fall sind Ihre Abrechnungszeiträume\n16.3. – 31.3.2020\n1.4. – 30.4.2020\n1.5. – 31.5.2020\n1.6. – 15.6.2020\n\nBitte beachten Sie, dass die Abrechnung grundsätzlich jeweils bis spätestens 28. des Folgemonats beim AMS eingelangt sein muss. Aufgrund der rückwirkenden Beantragungsmöglichkeit als auch des Rückstaus bei der Bearbeitung der Anträge ist eine Abrechnung für den Monat März auch noch bis 28.5.2020 möglich.\n\nDiese Werte werden gemäß Ihren Angaben bei \"Abrechnung erstellen/bearbeiten\" automatisch übernommen."]
["Erläuterung zu den MA-Stammdaten"]
["Bruttoentgelt vor COVID-19 Kurzarbeit"]
["Bitte tragen Sie hier das Bruttoentgelt (gemäß § 49 ASVG) des letzten voll versicherten Monats vor Beginn der Kurzarbeit ein.\n\nBeispiel: Der Kurzarbeitszeitraum beginnt am 16.3.2020, es ist für die März-Abrechnung das Bruttoentgelt vom Februar 2020 einzugeben.\nEntsprechend § 49 ASVG sind auch alle jene Zuschläge und Zulagen sowie Sachbezüge hinzuzurechnen, die regelmäßig Lohn-/Gehaltsbestandteile sind.\n\nNicht zu berücksichtigen sind: \n- Sonderzahlungen, \n- Entgeltanteile für Überstunden, außer es handelt sich um unwiderrufliche Überstundenpauschalen oder Anteile von All-inclusive-Entgelten, die der Abgeltung allfälliger Überstundenleistungen gewidmet sind und\n- Diäten und Aufwandsersätze, welche nicht der Sozialversicherung unterliegen.\n\nWenn Sie aus arbeitsrechtlichen Gründen etwas anderes eintragen müssen, dann bitten wir bereits jetzt um Verständnis, dass es zu Nachfragen von Seiten des AMS kommen kann."]
["Lehrling"]
["Im Falle von Lehrlingen sind Lehrlingsentschädigungen unter 461,- Euro zulässig und kein geringfügiges Beschäftigungsverhältnis.\n"]
["Normalarbeitszeit vor COVID-19 Kurzarbeit"]
["Bitte tragen Sie hier die wöchentliche Normalarbeitszeit vor Kurzarbeit ein.\n\na) Vollzeit\nBitte tragen Sie hier die kollektivvertragliche wöchentliche Normalarbeitszeit für die Arbeitnehmerin/den Arbeitnehmer/den Lehrling ein (Stunden pro Woche), z.B. 38,5 Stunden.\nWenn kein Kollektivvertrag anwendbar ist, kommen die Bestimmungen des Arbeitszeitgesetzes zur Anwendung und es ist grundsätzlich von einer 40 Stunden-Woche auszugehen.\n\nb) Teilzeit\nBitte tragen Sie hier die vertraglich vereinbarte wöchentliche Normalarbeitszeit für die Arbeitnehmerin/den Arbeitnehmer ein (Stunden pro Woche), z.B. 20 Stunden.\n"]
["Pauschalsatz COVID-19 Kurzarbeit"]
["Der Pauschalsatz ist jener Betrag, der pro ausgefallener Arbeitsstunde zur Berechnung der Beihilfe herangezogen wird. Im Pauschalsatz sind die Sozialversicherungsbeiträge und alle sonstigen lohnbezogenen Dienstgeberabgaben enthalten. Zur Abgeltung der anteiligen Sonderzahlungen berücksichtigt der Pauschalsatz auch eine pauschale Erhöhung um ein Sechstel. Die Einstufung erfolgt in Form von Lohnstufen (in Schritten von 50,- Euro), wobei innerhalb einer Lohnstufe der niedrigere Wert herangezogen wird.\n"]
["Erläuterung zu den Spalten des Abrechnungsblattes"]
["Bruttoentgelt für den ganzen Monat"]
["Bitte tragen Sie hier das Bruttoentgelt (gemäß § 49 ASVG) des Monats ein, den Sie abrechnen möchten. Bei Monaten, welche nicht zur Gänze der Kurzarbeit unterliegen (z.B. Beginn 16.3.2020), ist trotzdem das Bruttoentgelt für den gesamten Monat März anzugeben.\n\n Entsprechend § 49 ASVG sind auch alle jene Zuschläge und Zulagen sowie Sachbezüge hinzuzurechnen, die regelmäßig Lohn-/Gehaltsbestandteile sind.\n\nNicht zu berücksichtigen sind:\n- Sonderzahlungen,\n- Entgeltanteile für Überstunden, außer es handelt sich um unwiderrufliche Überstundenpauschalen oder\n   Anteile von All-inclusive-Entgelten, die der Abgeltung allfälliger Überstundenleistungen gewidmet sind und\n- Diäten und Aufwandsersätze, welche nicht der Sozialversicherung unterliegen."]
["Normalarbeitszeitstunden laut Kollektivvertrag/Arbeitsvertrag"]
["In dieses Feld ist die Summe der Normalarbeitszeitstunden des jeweiligen Abrechnungszeitraums einzugeben, so als würde nicht kurzgearbeitet werden. \nBei Teilzeitbeschäftigung sind die im Arbeitsvertrag vorgegebenen Normalarbeitszeitstunden als Berechnungsgrundlage heranzuziehen.\nBei Vollzeitbeschäftigung sind maximal die kollektivvertraglichen Normalarbeitszeitstunden als Berechnungsgrundlage heranzuziehen. Wenn kein Kollektivvertrag anwendbar ist, kommen die Bestimmungen des Arbeitszeitgesetzes zur Anwendung und es ist grundsätzlich von einer 40 Stunden-Woche auszugehen. \nBeispiel: Regelt der Kollektivvertrag eine Normalarbeitszeit von 40 Wochenstunden und sind jedoch im Arbeitsvertrag 48 Wochenstunden vereinbart, so sind 40 Wochenstunden als Berechnungsgrundlage maßgeblich.\nSofern in Ihrem Unternehmen üblicherweise an Feiertagen nicht gearbeitet wird, sind die Feiertage in die Berechnung nicht einzubeziehen.\n\nBeispiel: Bei einer 40-Stunden-Woche (Montag bis Freitag je 8 Stunden) ergeben sich unter Herausrechnung der Feiertage folgende Normalarbeitszeitstunden: \n- im Monat März 176 Normalarbeitszeitstunden (22 Arbeitstage x 8 Stunden);\n- im Monat April 168 Normalarbeitszeitstunden (21 Arbeitstage x 8 Stunden);\n- im Monat Mai 152 Normalarbeitszeitstunden (19 Arbeitstage x 8 Stunden ).\nBeginnt oder endet der Abrechnungszeitraum innerhalb eines Kalendermonats, sind nur jene Stunden aufzusummieren, die in den Abrechnungszeitraum fallen.\nNicht zu inkludieren sind Zeiten von Elternkarenz, Bildungskarenz, Zivil- oder Präsenzdienst oder vergleichbare Zeiten.\n\nBeispiel: Der Kurzarbeitszeitraum beginnt am 1.4.2020. Die Elternkarenz der Arbeitnehmerin/des Arbeitnehmers endet am 14.5.2020. Die Anzahl der Normalarbeitszeitstunden vom 1.4.2020 bis zum 14.5.2020 sind hier nicht zu erfassen.\n"]
["Stunden, für die Ersatzleistungen gebühren"]
["In diesem Feld sind die Normalarbeitszeitstunden anzuführen, für die Ihnen oder Ihrer Arbeitnehmerin/Ihrem Arbeitnehmer/Ihrem Lehrling Ersatzleistungen zustehen, das sind insbesondere \n- halbes oder volles Krankengeld;\n- Zuschüsse aus Mitteln der Unfallversicherung gemäß § 53b ASVG;\n- Bauarbeiter-Schlechtwetterentschädigung;\n- Kostenersätze gemäß § 32 Epidemiegesetz.\n\nNicht zu inkludieren sind Zeiten von Elternkarenz, Bildungskarenz, Zivil- oder Präsenzdienst oder vergleichbare Zeiten.\n\nDie Berechnung erfolgt wie beim Eingabefeld „Normalarbeitszeitstunden, die laut Arbeitsvertrag vorgegeben sind“.\n"]
["potentiell zu leistende Arbeitsstunden"]
["Dieser errechnete Wert wird als Basis (100 %) für die Berechnung des Prozentanteils an Ausfallstunden (höchstens 90 % und mindestens 10 % Ausfallzeit) über den gesamten Kurzarbeitszeitraum herangezogen.\n"]
["geleistete Arbeitsstunden"]
["Erfassen Sie hier die Summe der geleisteten Arbeitsstunden im Abrechnungszeitraum.\nAls geleistete Arbeitsstunden sind die tatsächlich erbrachten Stunden der Arbeitnehmerin/des Arbeitnehmers/des Lehrlings anzuführen. Überstunden sind hier nicht zu erfassen. (Überstunden fallen an, sobald die tägliche oder wöchentliche Normalarbeitszeit gemäß Kollektivvertrag oder Arbeitszeitgesetz überschritten wird (z.B. 8 Stunden täglich oder 40 Stunden wöchentlich).\nEs sind jedoch geleistete Arbeitsstunden an Sonn- und Feiertagen anzuführen, sofern diese laut Kollektivvertrag zulässig sind und zu keinem Überstundenentgelt führen. \n"]
["konsumierter Urlaub/konsumiertes Zeitguthaben"]
["Urlaubskonsum sowie Zeitausgleich sind entsprechend der tatsächlichen Stunden (bezogen auf das tägliche Stundenausmaß vor Kurzarbeit) einzutragen. \nBeispiel: Die Arbeitnehmerin/der Arbeitnehmer/der Lehrling konsumiert an einem Montag einen Urlaubstag. An diesem Montag hätte sie/er ohne Kurzarbeit 8 Stunden gearbeitet. Der Urlaubstag führt somit zu einem Abzug von 8 Urlaubsstunden unabhängig von der Reduzierung der Arbeitszeit während Kurzarbeit.\nBei Teilzeitkräften ist ebenfalls die entsprechende vertraglich vereinbarte tägliche Normalarbeitszeit vor Beginn der Kurzarbeit heranzuziehen. War beispielsweise vor Kurzarbeit für den Montag eine Arbeitszeit von 6 Stunden vereinbart und nimmt sich Ihre Arbeitnehmerin/Ihr Arbeitnehmer für diesen Tag Urlaub, so sind 6 Stunden anzuführen, selbst wenn während des Kurzarbeitszeitraums nur 2 Stunden vorgesehen wären.\n"]
["Entgeltfortzahlung für Krankenstand und § 1155 Abs. 3 ABGB in der geplanten Arbeitszeit"]
["Krankenstandsstunden mit vollständiger Entgeltfortzahlung sowie Stunden, für die Entgeltfortzahlung gemäß § 1155 Abs. 3 ABGB geleistet wurden und die in geplante Arbeitszeiten fallen, sind hier anzuführen. Unter die Entgeltfortzahlungspflicht gemäß § 1155 Abs. 3 ABGB fallen alle Betriebe, für die auf Grundlage des COVID-19-Maßnahmengesetzes Betretungsverbote oder Einschränkungen gelten.\nBeispiel: Die tägliche Normalarbeitszeit wird im Kurzarbeitszeitraum von 8 Stunden auf 2 Stunden reduziert. Erkrankt eine Arbeitnehmerin/ein Arbeitnehmer/ein Lehrling, ist die ausgefallene Arbeitszeit von 2 Stunden am Krankenstandstag heranzuziehen. Die derart angefallenen Stunden sind für den jeweiligen Abrechnungszeitraum aufzusummieren und hier einzutragen.\n\nBeispiel: Wurde die Arbeitszeit auf 10 % reduziert und liegt eine Entgeltfortzahlungspflicht gemäß § 1155 Abs. 3 ABGB vor, sind\n10 % der bisherigen wöchentlichen Normalarbeitszeit in diesem Feld einzutragen. Bei einer 40h-Woche somit 4 Stunden. Die derart angefallenen Stunden sind für den jeweiligen Abrechnungszeitraum aufzusummieren.\n"]
["errechnete Ausfallstunden"]
["Hier wird die Anzahl jener Stunden angezeigt, die sich nach Subtraktion der Werte aus den Feldern „geleistete Arbeitsstunden“, „konsumierter Urlaub/konsumiertes Zeitguthaben“, „Entgeltfortzahlung für Krankenstand und § 1155 Abs. 3 ABGB in der geplanten Arbeitszeit“ vom Wert des Feldes „errechnete potentiell zu leistende Arbeitsstunden“ ergeben.\n"]
["geleistete Überstunden (Stunden im Abrechnungszeitraum)"]
["Erfassen Sie hier die geleisteten und zu zahlenden Überstunden im Abrechnungszeitraum.\n\nDas Aufstocken der Arbeitszeit von beispielsweise 10 % auf 20 % im Rahmen der Kurzarbeit führt zu keinen Überstunden, solange die tägliche oder wöchentliche Normalarbeitszeit gemäß Kollektivvertrag oder Arbeitszeitgesetz nicht überschritten wurde.\n"]
["verrechnete Ausfallstunden (Stunden im Abrechnungszeitraum)"]
["Die errechneten Ausfallstunden werden um die Anzahl der geleisteten Überstunden reduziert und ergeben die verrechneten Ausfallstunden.\nHier wird die Gesamtanzahl der verrechneten Ausfallstunden aller vollständig erfassten Arbeitnehmerinnen/Arbeitnehmer und Lehrlinge, angezeigt. \n"]
["verrechneter Pauschalsatz COVID-19 Kurzarbeit (Euro pro Stunde)"]
["Der Pauschalsatz ist jener Betrag, der pro ausgefallener Arbeitsstunde zur Berechnung der Beihilfe herangezogen wird. Im Pauschalsatz sind die Sozialversicherungsbeiträge und alle sonstigen lohnbezogenen Dienstgeberabgaben enthalten. Zur Abgeltung der anteiligen Sonderzahlungen berücksichtigt der Pauschalsatz auch eine pauschale Erhöhung um ein Sechstel. Die Einstufung erfolgt in Form von Lohnstufen (in Schritten von 50,- Euro), wobei innerhalb einer Lohnstufe der niedrigere Wert herangezogen wird).\n"]
["verrechnete COVID-19 Kurzarbeitsbeihilfe"]
["Die verrechnete COVID-19 Kurzarbeitsbeihilfe für diese Arbeitnehmerin/diesen Arbeitnehmer bzw. Lehrling ergibt sich aus der Multiplikation von Pauschalsatz mal verrechenbarer Ausfallstunden.\n"]

{"sheet":"Eingabedaten","index":2,"n_rows":18,"n_cols":7,"rows_kept":18,"cut":false,"hidden":true,"merged":[[15,1,15,4],[16,1,16,4]]}
[]
[3]
["aktuelle Projektdaten:",null,null,null,"Abrechnungsdaten:"]
["Projektnummer",0,null,0]
[null,null,null,null,"Abrechnung von:","2020-03-01",41640]
["Beginn der Kurzarbeitsbeihilfe",null,null,null,"Abrechnung bis:",{"$f":"IF(AND(MONTH(F5)=MONTH(Projektende),YEAR(F5)=YEAR(Projektende)),Projektende,DATE(YEAR(F5),MONTH(F5)+1,0))","v":"2020-03-31"}]
["Ende der Kurzarbeitsbeihilfe",null,"Untergr.:"]
[null,null,{"$f":"IF(Projektbeginn>0,VLOOKUP(YEAR(Projektbeginn),Parameter!B50:C58,2),0)","v":0}]
[null,null,{"$f":"IF(ISBLANK(B14),Stichtag,B14+1)","v":"2020-03-01"}]
[]
["Vorgängerprojekt im Fall einer Verlängerung:"]
["Projektnummer alt",0,null,0]
["Beginn der Kurzarbeitsbeihilfe"]
["Ende der Kurzarbeitsbeihilfe"]
[]
[]
[]
["Stichtag:","2020-03-01"]

{"sheet":"Parameter","index":3,"n_rows":60,"n_cols":3,"rows_kept":60,"cut":false,"hidden":true,"merged":[]}
["Passwort:","kuaneu"]
["Blatt prüfen:",true]
["ftpcmd_file",{"$f":"tmp_path & \"ftpcmd\" & \".tmp\"","v":"c:\\tmp\\ftpcmd.tmp"}]
["dwh_user","xxx"]
["dwh_incoming","/dwhdata/incoming"]
["tmp_path","c:\\tmp\\"]
["ftp_bat",{"$f":"tmp_path & \"dwhftp.bat\"","v":"c:\\tmp\\dwhftp.bat"}]
["ftp_log",{"$f":"tmp_path & \"dwhftp.log\"","v":"c:\\tmp\\dwhftp.log"}]
["ftp_logneu",{"$f":"tmp_path & \"dwhftpneu.log\"","v":"c:\\tmp\\dwhftpneu.log"}]
["ftp_cmd","c:\\windows\\system32\\ftp.exe -s:"]
["dwh_host","xxx"]
["Prüfbericht","xxx"]
["Benutzer","xxx"]
["Protokoll","xxx"]
["Max.Personen",9999]
[]
["Forms_Name:","MSForms"]
["Forms_GUID:","{0D452EE1-E08F-101A-852E-02608C4D0BB4}"]
["Forms_Major:",2]
["Forms_Minor:",0]
[]
[]
[]
[]
["Normalarbeitszeit:",35,10]
[null,35.5,9]
[null,36,8]
[null,36.5,7]
[null,37,6]
[null,37.5,5]
[null,38,4]
[null,38.5,3]
[null,39,2]
[null,39.5,1]
[null,40,0]
[null,45,-1]
[null,48,-2]
[null,55,-3]
[null,60,-4]
[]
["Geschlecht:","M"]
[null,"W"]
[]
[]
["DGSV_berechtigt:","Ja - siehe Erläuterung 1"]
[null,"Ja - siehe Erläuterung 2"]
[null,"Nein"]
[]
[]
[]
["DGSV_Sätze:",2013,5180]
[null,2014,5285]
[null,2015,5425]
[null,2016,5670]
[null,2017,5810]
[null,2018,5985]
[null,2019,6090]
[null,2020,6265]
[null,2021,6265]
[null,2022]
{"$rows_left_out":1}
{"sheet":"MA-Stammdaten","index":4,"n_rows":2,"n_cols":19,"rows_kept":2,"cut":false,"hidden":false,"merged":[]}
[1,2,3,4,5,6,7,8,9,10,11,12,13,14,15,16,17,18,19]
["SV-Nummer","Familienname","Titel","Vorname","Geschl","Bruttoentgelt vor COVID-19 Kurzarbeit \nin Euro pro Monat","Lehrling","Normalarbeitszeit vor COVID-19 Kurzarbeit\nin Stunden pro Woche","Pauschalsatz COVID-19 Kurzarbeit\nin Euro pro Stunde","Mindestbrutto-entgelt bei COVID-19 Kurzarbeit\nin Euro pro Monat","Bruttoentgelt für den ganzen Monat\nin Euro pro Monat","Normalarbeits-zeitstunden, die laut Arbeitsvertrag vorgegeben sind","Stunden, für die Ersatzleistungen gebühren\nin Stunden im Abrechnungs-zeitraum","geleistete Arbeitsstunden\nin Stunden im Abrechnungs-zeitraum","konsumierter Urlaub/ konsumiertes Zeitguthaben\nin Stunden im Abrechnungs-zeitraum","Entgeltfortzahlung für Krankenstand und § 1155 Abs. 3 ABGB in der geplanten Arbeitszeit\nin Stunden im Abrechnungs-zeitraum","geleistete Überstunden\nin Stunden im Abrechnungs-zeitraum","Abrechnungs-\nzeitraum\nvon","Abrechnungs-\nzeitraum\nbis"]

{"sheet":"Muster Abrechnung","index":5,"n_rows":3,"n_cols":25,"rows_kept":3,"cut":false,"hidden":true,"merged":[]}
["2010-01-01",{"$f":"DAY(DATE(YEAR(A1),MONTH(A1)+1,0))","v":31}]
["SV-Nummer","Familienname","Titel","Vorname","Geschl","Bruttoentgelt vor COVID-19 Kurzarbeit \nin Euro pro Monat","Lehrling","Normalarbeitszeit vor COVID-19 Kurzarbeit\nin Stunden pro Woche","Mindestbrutto-entgelt bei COVID-19 Kurzarbeit\nin Euro pro Monat","Bruttoentgelt für den ganzen Monat\nin Euro pro Monat","Normalarbeits-zeitstunden laut Kollektivvertrag/\nArbeitsvertrag \nin Stunden im Abrechnungs-zeitraum","Stunden, für die Ersatzleistungen gebühren\nin Stunden im Abrechnungs-zeitraum","potentiell zu leistende Arbeitsstunden\nin Stunden im Abrechnungs-zeitraum","geleistete Arbeitsstunden\nin Stunden im Abrechnungs-zeitraum","konsumierter Urlaub/ konsumiertes Zeitguthaben\nin Stunden im Abrechnungs-zeitraum","Entgeltfortzahlung für Krankenstand und § 1155 Abs. 3 ABGB in der geplanten Arbeitszeit\nin Stunden im Abrechnungs-zeitraum","errechnete Ausfallstunden\nin Stunden im Abrechnungs-zeitraum","geleistete Überstunden\nin Stunden im Abrechnungs-zeitraum","verrechnete Ausfallstunden\nin Stunden im Abrechnungs-zeitraum","verrechneter Pauschalsatz COVID-19 Kurzarbeit\nin Euro pro Stunde","verrechnete COVID-19 Kurzarbeits-beihilfe (Pauschalsatz * verrechnete Ausfallstunden)\nin Euro für den Abrechnungs-zeitraum","Abrechnungs-\nzeitraum\nvon","Abrechnungs-\nzeitraum\nbis","Anmerkung 1","Anmerkung 2"]
[null,null,null,null,null,null,null,null,null,null,null,null,{"$f":"IF(ISNUMBER($K3),ROUND($K3,2)-ROUND($L3,2),0)","v":0},null,null,null,{"$f":"IF(ISNUMBER($M3),ROUND($M3,2)-ROUND($N3,2)-ROUND($O3,2)-ROUND($P3,2),0)","v":0},null,{"$f":"IF(ISNUMBER($Q3),MAX(ROUND($Q3,2)-ROUND($R3,2),0),0)","v":0},null,{"$f":"IF(OR($S3<0,$T3=\"\"),0,ROUND($S3*$T3,2))","v":0}]

{"sheet":"Muster Stammdaten","index":6,"n_rows":3,"n_cols":19,"rows_kept":3,"cut":false,"hidden":true,"merged":[]}
[1,2,3,4,5,6,7,8,9,10,11,12,13,14,15,16,17,18,19]
["SV-Nummer","Familienname","Titel","Vorname","Geschl","Bruttoentgelt vor COVID-19 Kurzarbeit \nin Euro pro Monat","Lehrling","Normalarbeitszeit vor COVID-19 Kurzarbeit\nin Stunden pro Woche","Pauschalsatz COVID-19 Kurzarbeit\nin Euro pro Stunde","Mindestbrutto-entgelt bei COVID-19 Kurzarbeit\nin Euro pro Monat","Bruttoentgelt für den ganzen Monat\nin Euro pro Monat","Normalarbeits-zeitstunden, die laut Arbeitsvertrag vorgegeben sind","Stunden, für die Ersatzleistungen gebühren\nin Stunden im Abrechnungs-zeitraum","geleistete Arbeitsstunden\nin Stunden im Abrechnungs-zeitraum","konsumierter Urlaub/ konsumiertes Zeitguthaben\nin Stunden im Abrechnungs-zeitraum","Entgeltfortzahlung für Krankenstand und § 1155 Abs. 3 ABGB in der geplanten Arbeitszeit\nin Stunden im Abrechnungs-zeitraum","geleistete Überstunden\nin Stunden im Abrechnungs-zeitraum","Abrechnungs-\nzeitraum\nvon","Abrechnungs-\nzeitraum\nbis"]
[null,null,null,null,null,3000,"N",38.5,{"$f":"IF(OR(AND($G3=\"N\",ROUND($F3,2)<'Pauschalsätze KUA'!$B$5),$H3=0),0,IF(ROUND($F3,2)>=MAX('Pauschalsätze KUA'!$B$4:$B$104),ROUND((INDEX('Pauschalsätze KUA'!$B$4:$D$104,MATCH(MAX('Pauschalsätze KUA'!$B$4:$B$104),'Pauschalsätze KUA'!$B$4:B$104,1),3)*7/6)/ROUND($H3*4.33,2),2),ROUND((INDEX('Pauschalsätze KUA'!$B$4:$D$104,MATCH(ROUND($F3,2),'Pauschalsätze KUA'!$B$4:$B$104,1),3)*7/6)/ROUND($H3*4.33,2),2)))","v":22.26},{"$f":"IF(OR(AND($G3=\"N\",ROUND($F3,2)<'Pauschalsätze KUA'!$B$5),$H3=0),0,IF($G3=\"J\",$F3,IF(ROUND($F3,2)>=MAX('Pauschalsätze KUA'!$B$4:$B$104),INDEX('Pauschalsätze KUA'!$B$4:$E$104,MATCH(MAX('Pauschalsätze KUA'!$B$4:$B$104),'Pauschalsätze KUA'!$B$4:$B$104,1),4),INDEX('Pauschalsätze KUA'!$B$4:$E$104,MATCH(ROUND($F3,2),'Pauschalsätze KUA'!$B$4:$B$104,1),4))))","v":2203.6799999999998}]

{"sheet":"Pauschalsätze KUA","index":7,"n_rows":106,"n_cols":6,"rows_kept":106,"cut":false,"hidden":true,"merged":[[0,3,2,3],[103,1,103,2],[0,0,2,0],[0,1,1,2],[0,5,2,5],[0,4,2,4]]}
["Lohn-gruppe","Monatsverdienst in  € \ninkl. Sonderzahlung",null,"Arbeits-kosten Neu","Mindest-Bruttoentgelt während KUA","Pauschal-satz bei 40 Stunden"]
[]
[null,"von","bis"]
[1,0,460.99,553.29999999999995,352.17,3.73]
[2,461,500.99,553.29999999999995,352.17,3.73]
[3,501,550.99,601.31000000000006,382.73,4.05]
[4,551,600.99,661.32,420.92,4.45]
[5,601,650.99,721.33,459.12,4.8600000000000003]
[6,651,700.99,781.33999999999992,585.9,5.26]
[7,701,750.99,841.35,630.9,5.67]
[8,751,800.99,901.36999999999989,675.91,6.07]
[9,801,850.99,961.36999999999989,720.9,6.48]
[10,851,900.99,1021.3900000000001,765.9,6.88]
[11,901,950.99,1081.3900000000001,810.9,7.28]
[12,951,1000.99,1141.4099999999999,855.9,7.69]
[13,1001,1050.99,1201.4199999999998,900.91,8.09]
[14,1051,1100.99,1261.4299999999998,945.9,8.5]
[15,1101,1150.99,1321.4399999999998,990.9,8.9]
[16,1151,1200.99,1381.4499999999998,1035.9000000000001,9.31]
[17,1201,1250.99,1441.4599999999998,1080.9000000000001,9.7100000000000009]
[18,1251,1300.99,1501.4800000000002,1125.9100000000001,10.11]
[19,1301,1350.99,1552.8700000000001,1160.76,10.46]
[20,1351,1400.99,1603.3400000000001,1194.51,10.8]
[21,1401,1450.99,1653.79,1228.25,11.14]
[22,1451,1500.99,1705.9899999999998,1264.04,11.49]
[23,1501,1550.99,1766,1309.05,11.9]
[24,1551,1600.99,1826.01,1354.04,12.3]
[25,1601,1650.99,1886.02,1399.05,12.7]
[26,1651,1700.99,1946.0399999999997,1444.05,13.11]
[27,1701,1750.99,1916.0900000000001,1383.07,12.91]
[28,1751,1800.99,1976.6,1408.02,13.31]
[29,1801,1850.99,2034.55,1450.01,13.7]
[30,1851,1900.99,2088.3800000000006,1487.13,14.07]
[31,1901,1950.99,2146.5899999999997,1507.03,14.46]
[32,1951,2000.99,2199.9299999999998,1542.99,14.82]
[33,2001,2050.9899999999998,2253.2799999999997,1578.97,15.18]
[34,2051,2100.9899999999998,2312.02,1597.12,15.57]
[35,2101,2150.9899999999998,2365.5,1632.67,15.93]
[36,2151,2200.9899999999998,2418.9699999999998,1668.19,16.29]
[37,2201,2250.9899999999998,2472.44,1703.72,16.649999999999999]
[38,2251,2300.9899999999998,2525.92,1759.99,17.010000000000002]
[39,2301,2350.9899999999998,2579.3899999999994,1795.95,17.37]
[40,2351,2400.9899999999998,2636.0400000000004,1835.68,17.760000000000002]
[41,2401,2450.9899999999998,2694.15,1877.17,18.149999999999999]
[42,2451,2500.9899999999998,2752.2500000000005,1941.78,18.54]
[43,2501,2550.9899999999998,2810.3599999999997,1983.77,18.93]
[44,2551,2600.9899999999998,2868.48,2025.76,19.32]
[45,2601,2650.99,2926.59,2093,19.71]
[46,2651,2700.99,2984.7300000000005,2135.5300000000002,20.100000000000001]
[47,2701,2750.99,2900.0800000000004,1979.5,19.53]
[48,2751,2800.99,2956.1600000000003,2019.03,19.91]
[49,2801,2850.99,3012.22,2083.6799999999998,20.29]
[50,2851,2900.99,3068.3,2123.69,20.67]
[51,2901,2950.99,3124.36,2163.69,21.05]
[52,2951,3000.99,3180.4199999999996,2203.6799999999998,21.42]
[53,3001,3050.99,3236.4799999999996,2243.67,21.8]
[54,3051,3100.99,3292.56,2283.6799999999998,22.18]
[55,3101,3150.99,3348.64,2323.6999999999998,22.56]
[56,3151,3200.99,3404.6899999999996,2363.6799999999998,22.93]
[57,3201,3250.99,3458.9,2401.42,23.3]
{"$rows_left_out":46}